Reaction Details
TargetMu-type opioid receptor
LigandBDBM50120147
Substrate/Competitorn/a
Meas. Tech.ChEMBL_148100 (CHEMBL751582)
Ki 1967±n/a nM
Citation Wu, WLCaplen, MADomalski, MSZhang, HFawzi, ABurnett, DA Synthesis and structure-activity relationships of aminoalkylazetidines as ORL1 receptor ligands. Bioorg Med Chem Lett12:3157-60 (2002) Mu-type opioid receptor
Name:Mu-type opioid receptor
Type:G Protein-Coupled Receptor (GPCR)
Mol. Mass.:44789.51
Organism:Homo sapiens (Human)
Description:P35372
Residue:400
BDBM50120147
NameBDBM50120147
Synonyms:C-[(S)-C-((S)-1-Benzhydryl-azetidin-2-yl)-C-(3-trifluoromethyl-phenyl)]-methylamine | CHEMBL316961
TypeSmall organic molecule
Emp. Form.C24H23F3N2
Mol. Mass.396.448
SMILESN[C@H]([C@@H]1CCN1C(c1ccccc1)c1ccccc1)c1cccc(c1)C(F)(F)F