Reaction Details
TargetKappa-type opioid receptor
LigandBDBM50120139
Substrate/Competitorn/a
Meas. Tech.ChEBML_145246
Ki 7718±n/a nM
Citation Wu, WLCaplen, MADomalski, MSZhang, HFawzi, ABurnett, DA Synthesis and structure-activity relationships of aminoalkylazetidines as ORL1 receptor ligands. Bioorg Med Chem Lett12:3157-60 (2002) Kappa-type opioid receptor
Name:Kappa-type opioid receptor
Type:G Protein-Coupled Receptor (GPCR)
Mol. Mass.:42648.76
Organism:Homo sapiens (Human)
Description:P41145
Residue:380
BDBM50120139
NameBDBM50120139
Synonyms:C-{(R)-C-(3-Chloro-phenyl)-C-[(S)-1-(1-phenyl-propyl)-azetidin-2-yl]}-methylamine | CHEMBL320804
TypeSmall organic molecule
Emp. Form.C19H23ClN2
Mol. Mass.314.852
SMILESCCC(N1CC[C@H]1[C@H](N)c1cccc(Cl)c1)c1ccccc1