Reaction Details
TargetKappa-type opioid receptor
LigandBDBM50120146
Substrate/Competitorn/a
Meas. Tech.ChEBML_145246
Ki 2938±n/a nM
Citation Wu, WLCaplen, MADomalski, MSZhang, HFawzi, ABurnett, DA Synthesis and structure-activity relationships of aminoalkylazetidines as ORL1 receptor ligands. Bioorg Med Chem Lett12:3157-60 (2002) Kappa-type opioid receptor
Name:Kappa-type opioid receptor
Type:G Protein-Coupled Receptor (GPCR)
Mol. Mass.:42648.76
Organism:Homo sapiens (Human)
Description:P41145
Residue:380
BDBM50120146
NameBDBM50120146
Synonyms:C-{(S)-C-(3-Chloro-phenyl)-C-[(S)-1-(1-phenyl-butyl)-azetidin-2-yl]}-methylamine | CHEMBL110933
TypeSmall organic molecule
Emp. Form.C20H25ClN2
Mol. Mass.328.879
SMILESCCCC(N1CC[C@H]1[C@@H](N)c1cccc(Cl)c1)c1ccccc1