Reaction Details
TargetKappa-type opioid receptor
LigandBDBM50120149
Substrate/Competitorn/a
Meas. Tech.ChEBML_145246
Ki 660±n/a nM
Citation Wu, WLCaplen, MADomalski, MSZhang, HFawzi, ABurnett, DA Synthesis and structure-activity relationships of aminoalkylazetidines as ORL1 receptor ligands. Bioorg Med Chem Lett12:3157-60 (2002) Kappa-type opioid receptor
Name:Kappa-type opioid receptor
Type:G Protein-Coupled Receptor (GPCR)
Mol. Mass.:42648.76
Organism:Homo sapiens (Human)
Description:P41145
Residue:380
BDBM50120149
NameBDBM50120149
Synonyms:C-[(S)-C-((S)-1-Benzhydryl-azetidin-2-yl)-C-p-tolyl]-methylamine | CHEMBL110126
TypeSmall organic molecule
Emp. Form.C24H26N2
Mol. Mass.342.4766
SMILESCc1ccc(cc1)[C@H](N)[C@@H]1CCN1C(c1ccccc1)c1ccccc1