Reaction Details
TargetNociceptin receptor
LigandBDBM50120153
Substrate/Competitorn/a
Meas. Tech.ChEBML_145007
Ki 680±n/a nM
Citation Wu, WLCaplen, MADomalski, MSZhang, HFawzi, ABurnett, DA Synthesis and structure-activity relationships of aminoalkylazetidines as ORL1 receptor ligands. Bioorg Med Chem Lett12:3157-60 (2002) Nociceptin receptor
Name:Nociceptin receptor
Type:G Protein-Coupled Receptor (GPCR)
Mol. Mass.:40702.87
Organism:Homo sapiens (Human)
Description:P41146
Residue:370
BDBM50120153
NameBDBM50120153
Synonyms:C-((S)-C-(3-Chloro-phenyl)-C-{(S)-1-[1-(3-fluoro-phenyl)-pentyl]-azetidin-2-yl})-methylamine | CHEMBL106190
TypeSmall organic molecule
Emp. Form.C21H26ClFN2
Mol. Mass.360.896
SMILESCCCCC(N1CC[C@H]1[C@@H](N)c1cccc(Cl)c1)c1cccc(F)c1