Reaction Details
TargetMu-type opioid receptor
LigandBDBM50120155
Substrate/Competitorn/a
Meas. Tech.ChEBML_148100
Ki 4245±n/a nM
Citation Wu, WLCaplen, MADomalski, MSZhang, HFawzi, ABurnett, DA Synthesis and structure-activity relationships of aminoalkylazetidines as ORL1 receptor ligands. Bioorg Med Chem Lett12:3157-60 (2002) Mu-type opioid receptor
Name:Mu-type opioid receptor
Type:G Protein-Coupled Receptor (GPCR)
Mol. Mass.:44789.51
Organism:Homo sapiens (Human)
Description:P35372
Residue:400
BDBM50120155
NameBDBM50120155
Synonyms:C-[(S)-C-((S)-1-Benzhydryl-azetidin-2-yl)-C-(3,5-difluoro-phenyl)]-methylamine | CHEMBL419179
TypeSmall organic molecule
Emp. Form.C23H22F2N2
Mol. Mass.364.431
SMILESN[C@H]([C@@H]1CCN1C(c1ccccc1)c1ccccc1)c1cc(F)cc(F)c1