Reaction Details
TargetNociceptin receptor
LigandBDBM50120158
Substrate/Competitorn/a
Meas. Tech.ChEBML_145007
Ki 1135±n/a nM
Citation Wu, WLCaplen, MADomalski, MSZhang, HFawzi, ABurnett, DA Synthesis and structure-activity relationships of aminoalkylazetidines as ORL1 receptor ligands. Bioorg Med Chem Lett12:3157-60 (2002) Nociceptin receptor
Name:Nociceptin receptor
Type:G Protein-Coupled Receptor (GPCR)
Mol. Mass.:40702.87
Organism:Homo sapiens (Human)
Description:P41146
Residue:370
BDBM50120158
NameBDBM50120158
Synonyms:C-[(R)-C-(3-Chloro-phenyl)-C-((S)-1-di-p-tolylmethyl-azetidin-2-yl)]-methylamine | CHEMBL110138
TypeSmall organic molecule
Emp. Form.C25H27ClN2
Mol. Mass.390.948
SMILESCc1ccc(cc1)C(N1CC[C@H]1[C@H](N)c1cccc(Cl)c1)c1ccc(C)cc1