Reaction Details
TargetNociceptin receptor
LigandBDBM50120163
Substrate/Competitorn/a
Meas. Tech.ChEBML_145007
Ki 1016±n/a nM
Citation Wu, WLCaplen, MADomalski, MSZhang, HFawzi, ABurnett, DA Synthesis and structure-activity relationships of aminoalkylazetidines as ORL1 receptor ligands. Bioorg Med Chem Lett12:3157-60 (2002) Nociceptin receptor
Name:Nociceptin receptor
Type:G Protein-Coupled Receptor (GPCR)
Mol. Mass.:40702.87
Organism:Homo sapiens (Human)
Description:P41146
Residue:370
BDBM50120163
NameBDBM50120163
Synonyms:C-{(S)-C-(3-Chloro-phenyl)-C-[(S)-1-(1-phenyl-heptyl)-azetidin-2-yl]}-methylamine | CHEMBL322717
TypeSmall organic molecule
Emp. Form.C23H31ClN2
Mol. Mass.370.959
SMILESCCCCCCC(N1CC[C@H]1[C@@H](N)c1cccc(Cl)c1)c1ccccc1