Reaction Details
TargetMu-type opioid receptor
LigandBDBM50120140
Substrate/Competitorn/a
Meas. Tech.ChEBML_148100
Ki 1939±n/a nM
Citation Wu, WLCaplen, MADomalski, MSZhang, HFawzi, ABurnett, DA Synthesis and structure-activity relationships of aminoalkylazetidines as ORL1 receptor ligands. Bioorg Med Chem Lett12:3157-60 (2002) Mu-type opioid receptor
Name:Mu-type opioid receptor
Type:G Protein-Coupled Receptor (GPCR)
Mol. Mass.:44789.51
Organism:Homo sapiens (Human)
Description:P35372
Residue:400
BDBM50120140
NameBDBM50120140
Synonyms:C-{(R)-C-(3-Chloro-phenyl)-C-[(S)-1-(1-phenyl-hexyl)-azetidin-2-yl]}-methylamine | CHEMBL108995
TypeSmall organic molecule
Emp. Form.C22H29ClN2
Mol. Mass.356.932
SMILESCCCCCC(N1CC[C@H]1[C@H](N)c1cccc(Cl)c1)c1ccccc1