Reaction Details
TargetKappa-type opioid receptor
LigandBDBM50120168
Substrate/Competitorn/a
Meas. Tech.ChEBML_145246
Ki 3684±n/a nM
Citation Wu, WLCaplen, MADomalski, MSZhang, HFawzi, ABurnett, DA Synthesis and structure-activity relationships of aminoalkylazetidines as ORL1 receptor ligands. Bioorg Med Chem Lett12:3157-60 (2002) Kappa-type opioid receptor
Name:Kappa-type opioid receptor
Type:G Protein-Coupled Receptor (GPCR)
Mol. Mass.:42648.76
Organism:Homo sapiens (Human)
Description:P41145
Residue:380
BDBM50120168
NameBDBM50120168
Synonyms:C-{(S)-C-(3-Chloro-phenyl)-C-[(S)-1-(1-phenyl-pentyl)-azetidin-2-yl]}-methylamine | CHEMBL107288
TypeSmall organic molecule
Emp. Form.C21H27ClN2
Mol. Mass.342.905
SMILESCCCCC(N1CC[C@H]1[C@@H](N)c1cccc(Cl)c1)c1ccccc1