Reaction Details
TargetNociceptin receptor
LigandBDBM50120169
Substrate/Competitorn/a
Meas. Tech.ChEBML_145007
Ki 2593±n/a nM
Citation Wu, WLCaplen, MADomalski, MSZhang, HFawzi, ABurnett, DA Synthesis and structure-activity relationships of aminoalkylazetidines as ORL1 receptor ligands. Bioorg Med Chem Lett12:3157-60 (2002) Nociceptin receptor
Name:Nociceptin receptor
Type:G Protein-Coupled Receptor (GPCR)
Mol. Mass.:40702.87
Organism:Homo sapiens (Human)
Description:P41146
Residue:370
BDBM50120169
NameBDBM50120169
Synonyms:C-[(R)-C-{(S)-1-[Bis-(3-trifluoromethyl-phenyl)-methyl]-azetidin-2-yl}-C-(3-chloro-phenyl)]-methylamine | CHEMBL320061
TypeSmall organic molecule
Emp. Form.C25H21ClF6N2
Mol. Mass.498.891
SMILESN[C@@H]([C@@H]1CCN1C(c1cccc(c1)C(F)(F)F)c1cccc(c1)C(F)(F)F)c1cccc(Cl)c1