Reaction Details
TargetKappa-type opioid receptor
LigandBDBM50120165
Substrate/Competitorn/a
Meas. Tech.ChEBML_145246
Ki 1341±n/a nM
Citation Wu, WLCaplen, MADomalski, MSZhang, HFawzi, ABurnett, DA Synthesis and structure-activity relationships of aminoalkylazetidines as ORL1 receptor ligands. Bioorg Med Chem Lett12:3157-60 (2002) Kappa-type opioid receptor
Name:Kappa-type opioid receptor
Type:G Protein-Coupled Receptor (GPCR)
Mol. Mass.:42648.76
Organism:Homo sapiens (Human)
Description:P41145
Residue:380
BDBM50120165
NameBDBM50120165
Synonyms:C-[(S)-C-((S)-1-Benzhydryl-azetidin-2-yl)-C-(4-methoxy-phenyl)]-methylamine | CHEMBL448155
TypeSmall organic molecule
Emp. Form.C24H26N2O
Mol. Mass.358.476
SMILESCOc1ccc(cc1)[C@H](N)[C@@H]1CCN1C(c1ccccc1)c1ccccc1