Reaction Details
TargetKappa-type opioid receptor
LigandBDBM50120154
Substrate/Competitorn/a
Meas. Tech.ChEBML_145246
Ki 6037±n/a nM
Citation Wu, WLCaplen, MADomalski, MSZhang, HFawzi, ABurnett, DA Synthesis and structure-activity relationships of aminoalkylazetidines as ORL1 receptor ligands. Bioorg Med Chem Lett12:3157-60 (2002) Kappa-type opioid receptor
Name:Kappa-type opioid receptor
Type:G Protein-Coupled Receptor (GPCR)
Mol. Mass.:42648.76
Organism:Homo sapiens (Human)
Description:P41145
Residue:380
BDBM50120154
NameBDBM50120154
Synonyms:C-[(R)-C-{(S)-1-[Bis-(3-chloro-phenyl)-methyl]-azetidin-2-yl}-C-(3-chloro-phenyl)]-methylamine | CHEMBL327118
TypeSmall organic molecule
Emp. Form.C23H21Cl3N2
Mol. Mass.431.785
SMILESN[C@@H]([C@@H]1CCN1C(c1cccc(Cl)c1)c1cccc(Cl)c1)c1cccc(Cl)c1