Reaction Details
TargetNociceptin receptor
LigandBDBM50120168
Substrate/Competitorn/a
Meas. Tech.ChEBML_145007
Ki 745±n/a nM
Citation Wu, WLCaplen, MADomalski, MSZhang, HFawzi, ABurnett, DA Synthesis and structure-activity relationships of aminoalkylazetidines as ORL1 receptor ligands. Bioorg Med Chem Lett12:3157-60 (2002) Nociceptin receptor
Name:Nociceptin receptor
Type:G Protein-Coupled Receptor (GPCR)
Mol. Mass.:40702.87
Organism:Homo sapiens (Human)
Description:P41146
Residue:370
BDBM50120168
NameBDBM50120168
Synonyms:C-{(S)-C-(3-Chloro-phenyl)-C-[(S)-1-(1-phenyl-pentyl)-azetidin-2-yl]}-methylamine | CHEMBL107288
TypeSmall organic molecule
Emp. Form.C21H27ClN2
Mol. Mass.342.905
SMILESCCCCC(N1CC[C@H]1[C@@H](N)c1cccc(Cl)c1)c1ccccc1