Reaction Details
TargetD(2) dopamine receptor
LigandBDBM50077581
Substrate/Competitorn/a
Meas. Tech.ChEMBL_61464 (CHEMBL671445)
Ki 0.140000±n/a nM
Citation Mewshaw, REZhao, RShi, XMarquis, KBrennan, JAMazandarani, HCoupet, JAndree, TH New generation dopaminergic agents. Part 8: heterocyclic bioisosteres that exploit the 7-OH-2-(aminomethyl)chroman D(2) template. Bioorg Med Chem Lett12:271-4 (2002) D(2) dopamine receptor
Name:D(2) dopamine receptor
Type:G Protein-Coupled Receptor (GPCR)
Mol. Mass.:50931.60
Organism:Rattus norvegicus (rat)
Description:P61169
Residue:444
BDBM50077581
NameBDBM50077581
Synonyms:(R)-2-(Benzylamino-methyl)-3,4,7,9-tetrahydro-2H-pyrano[2,3-e]indol-8-one | CHEMBL303556
TypeSmall organic molecule
Emp. Form.C19H20N2O2
Mol. Mass.308.3743
SMILESO=C1Cc2c(N1)ccc1CC[C@H](CNCc3ccccc3)Oc21