Reaction Details
TargetD(2) dopamine receptor
LigandBDBM50109021
Substrate/Competitorn/a
Meas. Tech.ChEBML_61802
Ki 3±n/a nM
Citation Mewshaw, REZhao, RShi, XMarquis, KBrennan, JAMazandarani, HCoupet, JAndree, TH New generation dopaminergic agents. Part 8: heterocyclic bioisosteres that exploit the 7-OH-2-(aminomethyl)chroman D(2) template. Bioorg Med Chem Lett12:271-4 (2002) D(2) dopamine receptor
Name:D(2) dopamine receptor
Type:Cell-surface receptors
Mol. Mass.:50647.10
Organism:Homo sapiens (Human)
Description:P14416
Residue:443
BDBM50109021
NameBDBM50109021
Synonyms:(R)-8-(Benzylamino-methyl)-3,6,7,8-tetrahydro-1H-chromeno[7,8-d]imidazol-2-one | CHEMBL420986
TypeSmall organic molecule
Emp. Form.C18H19N3O2
Mol. Mass.309.3624
SMILESO=c1[nH]c2ccc3CC[C@H](CNCc4ccccc4)Oc3c2[nH]1