Reaction Details
TargetAdenosylhomocysteinase
LigandBDBM50109313
Substrate/Competitorn/a
Meas. Tech.ChEMBL_196565 (CHEMBL802330)
Ki 1094000±n/a nM
Citation Steere, JASampson, PBHonek, JF Synthesis of an alpha-aminophosphonate nucleoside as an inhibitor of S-adenosyl-L-homocysteine hydrolase. Bioorg Med Chem Lett12:457-60 (2002) Adenosylhomocysteinase
Name:Adenosylhomocysteinase
Type:PROTEIN
Mol. Mass.:47537.52
Organism:Rattus norvegicus
Description:ChEMBL_1507790
Residue:432
BDBM50109313
NameBDBM50109313
Synonyms:4-[5-(6-amino-9H-9-purinyl)-3,4-dihydroxy-(3S,4R)-tetrahydro-2-furanylmethylsulfanyl]-2-ammonio-(2S)-butanoate | CHEMBL142828
TypeSmall organic molecule
Emp. Form.C14H20N6O5S
Mol. Mass.384.411
SMILESNc1ncnc2n(cnc12)C1OC(CSCC[C@H]([NH3+])C([O-])=O)[C@@H](O)[C@H]1O