Reaction Details
TargetcAMP-specific 3',5'-cyclic phosphodiesterase 4A/4B/4C/4D
LigandBDBM50451480
Substrate/Competitorn/a
Meas. Tech.ChEMBL_157379 (CHEMBL763644)
Ki 63±n/a nM
Citation Andrés, JIAlonso, JMDíaz, AFernández, JIturrino, LMartínez, PMatesanz, EFreyne, EJDeroose, FBoeckx, GPetit, DDiels, GMegens, ASomers, MVan Wauwe, JStoppie, PCools, MDe Clerck, FPeeters, Dde Chaffoy, D Synthesis and biological evaluation of imidazol-2-one and 2-cyanoiminoimidazole derivatives: novel series of PDE4 inhibitors. Bioorg Med Chem Lett12:653-8 (2002) cAMP-specific 3',5'-cyclic phosphodiesterase 4A/4B/4C/4D
Name:cAMP-specific 3',5'-cyclic phosphodiesterase 4A/4B/4C/4D
Synonyms:Phosphodiesterase 4
Type:n/a
Mol. Mass.:n/a
Description:ASSAY_ID of ChEMBL is 193660
Components:This complex has 4 components.
Component 1
Name:cAMP-specific 3',5'-cyclic phosphodiesterase 4B
Type:Enzyme Catalytic Domain
Mol. Mass.:83349.50
Organism:RAT
Description:P14646
Residue:736
Component 2
Name:cAMP-specific 3',5'-cyclic phosphodiesterase 4D
Synonyms:DPDE3 Pde4d
Type:PROTEIN
Mol. Mass.:90531.57
Organism:Rattus norvegicus
Description:ChEMBL_104732
Residue:803
Component 3
Name:cAMP-specific 3',5'-cyclic phosphodiesterase 4A
Synonyms:DPDE2 Pde4a
Type:PROTEIN
Mol. Mass.:93412.58
Organism:Rattus norvegicus
Description:ChEMBL_104732
Residue:844
Component 4
Name:cAMP-specific 3',5'-cyclic phosphodiesterase 4C
Synonyms:Dpde1 Pde4c
Type:PROTEIN
Mol. Mass.:60038.21
Organism:Rattus norvegicus
Description:ChEMBL_104732
Residue:536
BDBM50451480
NameBDBM50451480
Synonyms:CHEMBL2093042
TypeSmall organic molecule
Emp. Form.C23H24N4O2
Mol. Mass.388.4623
SMILESCOc1ccc(cc1OC1Cc2ccccc2C1)[C@@H](C)Cn1cc[nH]\c1=N/C#N