Reaction Details
TargetcAMP-specific 3',5'-cyclic phosphodiesterase 4B
LigandBDBM14775
Substrate/Competitorn/a
Meas. Tech.ChEBML_222610
IC50 0.200000±n/a nM
Citation Andrés, JIAlonso, JMDíaz, AFernández, JIturrino, LMartínez, PMatesanz, EFreyne, EJDeroose, FBoeckx, GPetit, DDiels, GMegens, ASomers, MVan Wauwe, JStoppie, PCools, MDe Clerck, FPeeters, Dde Chaffoy, D Synthesis and biological evaluation of imidazol-2-one and 2-cyanoiminoimidazole derivatives: novel series of PDE4 inhibitors. Bioorg Med Chem Lett12:653-8 (2002) cAMP-specific 3',5'-cyclic phosphodiesterase 4B
Name:cAMP-specific 3',5'-cyclic phosphodiesterase 4B
Type:Protein
Mol. Mass.:83318.87
Organism:Homo sapiens (Human)
Description:Q07343
Residue:736
BDBM14775
NameBDBM14775
Synonyms:3-(cyclopentyloxy)-N-(3,5-dichloropyridin-4-yl)-4-methoxybenzamide CHEMBL42126 Piclamilast | RPR-73401
TypeSmall organic molecule
Emp. Form.C18H18Cl2N2O3
Mol. Mass.381.253
SMILESCOc1ccc(cc1OC1CCCC1)C(=O)Nc1c(Cl)cncc1Cl