Reaction Details
TargetMitogen-activated protein kinase 11/12/13/14
LigandBDBM50219323
Substrate/Competitorn/a
Meas. Tech.ChEMBL_124338 (CHEMBL732894)
IC50 0.600000±n/a nM
Citation McIntyre, CJPonticello, GSLiverton, NJO'Keefe, SJO'Neill, EAPang, MSchwartz, CDClaremon, DA Pyridazine based inhibitors of p38 MAPK. Bioorg Med Chem Lett12:689-92 (2002) Mitogen-activated protein kinase 11/12/13/14
Name:Mitogen-activated protein kinase 11/12/13/14
Synonyms:MAP kinase p38
Type:n/a
Mol. Mass.:n/a
Description:ASSAY_ID of ChEMBL is 1935922
Components:This complex has 4 components.
Component 1
Name:Mitogen-activated protein kinase 13
Type:Enzyme
Mol. Mass.:42097.16
Organism:Homo sapiens (Human)
Description:O15264
Residue:365
Component 2
Name:Mitogen-activated protein kinase 11
Synonyms:MAP kinase p38 MK11_HUMAN Mitogen-activated protein kinase p38 beta SAPK2 Stress-activated protein kinase 2 p38-2 p38b
Type:Enzyme Catalytic Domain
Mol. Mass.:41351.73
Organism:Homo sapiens (Human)
Description:gi_20128774
Residue:364
Component 3
Name:Mitogen-activated protein kinase 14
Synonyms:CSAID-binding protein CSBP1 CSPB1 MAP kinase 14 MAP kinase p38 alpha MAPK14 MK14_HUMAN Mitogen-activated protein kinase p38 alpha Stress-activated protein kinase 2a | p38 MAP kinase alpha/beta
Type:Serine/threonine-protein kinase
Mol. Mass.:41286.76
Organism:Homo sapiens (Human)
Description:Q16539
Residue:360
Component 4
Name:Mitogen-activated protein kinase 12
Synonyms:ERK6 MAPK12 Mitogen-activated protein kinase 12 (MAPK12 p38 gamma) Mitogen-activated protein kinase 12 Gamma SAPK3 | p38 delta/gamma
Type:Protein
Mol. Mass.:41938.69
Organism:Homo sapiens (Human)
Description:P53778
Residue:367
BDBM50219323
NameBDBM50219323
Synonyms:CHEMBL161276
TypeSmall organic molecule
Emp. Form.C27H26F3N7
Mol. Mass.505.5374
SMILESC[C@H](Nc1nccc(n1)-c1cc(nnc1-c1cccc(c1)C(F)(F)F)N1CCNCC1)c1ccccc1