Reaction Details
TargetTrypsin
LigandBDBM50110379
Substrate/Competitorn/a
Meas. Tech.ChEMBL_212872 (CHEMBL817822)
Ki 20±n/a nM
Citation Ho, JZGibson, TSSemple, JE Novel, potent non-covalent thrombin inhibitors incorporating p(3)-lactam scaffolds. Bioorg Med Chem Lett12:743-8 (2002) Trypsin
Name:Trypsin
Synonyms:Serine protease 1/Trypsin-2/Trypsin-3
Type:n/a
Mol. Mass.:n/a
Description:ASSAY_ID of ChEMBL is 2155713
Components:This complex has 3 components.
Component 1
Name:Serine protease 1
Type:Enzyme
Mol. Mass.:26557.80
Organism:Homo sapiens (Human)
Description:P07477
Residue:247
Component 2
Name:Trypsin-2
Synonyms:Anionic trypsinogen Serine protease 2 TRY2_HUMAN Thrombin & trypsin Trypsin II | Trypsin-2
Type:PROTEIN
Mol. Mass.:26479.43
Organism:Homo sapiens (Human)
Description:ChEMBL_41517
Residue:247
Component 3
Name:Trypsin-3
Synonyms:Brain trypsinogen PRSS3 Serine protease 3 TRY3 TRY4 Trypsin Trypsin IV | Trypsin-3
Type:PROTEIN
Mol. Mass.:32532.52
Organism:Homo sapiens (Human)
Description:ChEMBL_216043
Residue:304
BDBM50110379
NameBDBM50110379
Synonyms:4-{3-[(S)-3-(2,3-Dihydro-benzofuran-5-sulfonylamino)-2-oxo-2,3,4,5-tetrahydro-benzo[b]azepin-1-yl]-2-oxo-propyl}-benzamidine | CHEMBL351256
TypeSmall organic molecule
Emp. Form.C28H28N4O5S
Mol. Mass.532.611
SMILESNC(=N)c1ccc(CC(=O)CN2c3ccccc3CC[C@H](NS(=O)(=O)c3ccc4OCCc4c3)C2=O)cc1