Reaction Details
TargetProthrombin
LigandBDBM50110377
Substrate/Competitorn/a
Meas. Tech.ChEBML_208524
Ki 53±n/a nM
Citation Ho, JZGibson, TSSemple, JE Novel, potent non-covalent thrombin inhibitors incorporating p(3)-lactam scaffolds. Bioorg Med Chem Lett12:743-8 (2002) Prothrombin
Name:Prothrombin
Type:Protein
Mol. Mass.:70029.57
Organism:Homo sapiens (Human)
Description:P00734
Residue:622
BDBM50110377
NameBDBM50110377
Synonyms:2,3-Dihydro-benzofuran-5-sulfonic acid {(S)-1-[3-(4-amino-cyclohexyl)-2-oxo-propyl]-2-oxo-azepan-3-yl}-amide | CHEMBL164180
TypeSmall organic molecule
Emp. Form.C23H33N3O5S
Mol. Mass.463.59
SMILESN[C@H]1CC[C@H](CC(=O)CN2CCCC[C@H](NS(=O)(=O)c3ccc4OCCc4c3)C2=O)CC1