Reaction Details
TargetProthrombin
LigandBDBM50110382
Substrate/Competitorn/a
Meas. Tech.ChEBML_208524
Ki 0.540000±n/a nM
Citation Ho, JZGibson, TSSemple, JE Novel, potent non-covalent thrombin inhibitors incorporating p(3)-lactam scaffolds. Bioorg Med Chem Lett12:743-8 (2002) Prothrombin
Name:Prothrombin
Type:Protein
Mol. Mass.:70029.57
Organism:Homo sapiens (Human)
Description:P00734
Residue:622
BDBM50110382
NameBDBM50110382
Synonyms:P1 argininal derivative | [amino({[(4S)-4-carboxy-4-{2-[(3S)-2-oxo-3-(phenylmethane)sulfonamidoazepan-1-yl]acetamido}butyl]amino})methylidene]azanium
TypeSmall organic molecule
Emp. Form.C21H33N6O6S
Mol. Mass.497.588
SMILESNC(=[NH2+])NCCC[C@H](NC(=O)CN1CCCC[C@H](NS(=O)(=O)Cc2ccccc2)C1=O)C(O)=O