Reaction Details
TargetProthrombin
LigandBDBM50110386
Substrate/Competitorn/a
Meas. Tech.ChEBML_208524
Ki 9±n/a nM
Citation Ho, JZGibson, TSSemple, JE Novel, potent non-covalent thrombin inhibitors incorporating p(3)-lactam scaffolds. Bioorg Med Chem Lett12:743-8 (2002) Prothrombin
Name:Prothrombin
Type:Protein
Mol. Mass.:70029.57
Organism:Homo sapiens (Human)
Description:P00734
Residue:622
BDBM50110386
NameBDBM50110386
Synonyms:4-{3-[(S)-3-(2,5-Dimethoxy-benzenesulfonylamino)-2-oxo-azepan-1-yl]-2-oxo-propyl}-benzamidine | CHEMBL165665
TypeSmall organic molecule
Emp. Form.C24H30N4O6S
Mol. Mass.502.583
SMILESCOc1ccc(OC)c(c1)S(=O)(=O)N[C@H]1CCCCN(CC(=O)Cc2ccc(cc2)C(N)=N)C1=O