Reaction Details
TargetProthrombin
LigandBDBM50110378
Substrate/Competitorn/a
Meas. Tech.ChEBML_208524
Ki 93±n/a nM
Citation Ho, JZGibson, TSSemple, JE Novel, potent non-covalent thrombin inhibitors incorporating p(3)-lactam scaffolds. Bioorg Med Chem Lett12:743-8 (2002) Prothrombin
Name:Prothrombin
Type:Protein
Mol. Mass.:70029.57
Organism:Homo sapiens (Human)
Description:P00734
Residue:622
BDBM50110378
NameBDBM50110378
Synonyms:CHEMBL350262 | N-{(S)-1-[3-(6-Amino-2-methyl-pyridin-3-yl)-2-oxo-propyl]-2-oxo-azepan-3-yl}-C-phenyl-methanesulfonamide
TypeSmall organic molecule
Emp. Form.C22H28N4O4S
Mol. Mass.444.547
SMILESCc1nc(N)ccc1CC(=O)CN1CCCC[C@H](NS(=O)(=O)Cc2ccccc2)C1=O