Reaction Details
TargetCoagulation factor X
LigandBDBM50110393
Substrate/Competitorn/a
Meas. Tech.ChEBML_49313
Ki 53±n/a nM
Citation Ho, JZGibson, TSSemple, JE Novel, potent non-covalent thrombin inhibitors incorporating p(3)-lactam scaffolds. Bioorg Med Chem Lett12:743-8 (2002) Coagulation factor X
Name:Coagulation factor X
Type:Enzyme
Mol. Mass.:54726.60
Organism:Homo sapiens (Human)
Description:n/a
Residue:488
BDBM50110393
NameBDBM50110393
Synonyms:5-{3-[(S)-3-(2,3-Dihydro-benzofuran-5-sulfonylamino)-2-oxo-azepan-1-yl]-2-oxo-propyl}-thiophene-2-carboxamidine | CHEMBL162452
TypeSmall organic molecule
Emp. Form.C22H26N4O5S2
Mol. Mass.490.596
SMILESNC(=N)c1ccc(CC(=O)CN2CCCC[C@H](NS(=O)(=O)c3ccc4OCCc4c3)C2=O)s1