Reaction Details
TargetProthrombin
LigandBDBM50110389
Substrate/Competitorn/a
Meas. Tech.ChEBML_208524
Ki 6.2±n/a nM
Citation Ho, JZGibson, TSSemple, JE Novel, potent non-covalent thrombin inhibitors incorporating p(3)-lactam scaffolds. Bioorg Med Chem Lett12:743-8 (2002) Prothrombin
Name:Prothrombin
Type:Protein
Mol. Mass.:70029.57
Organism:Homo sapiens (Human)
Description:P00734
Residue:622
BDBM50110389
NameBDBM50110389
Synonyms:4-{3-[(S)-3-(2,3-Dihydro-benzofuran-5-sulfonylamino)-2-oxo-azepan-1-yl]-2-oxo-propyl}-benzamidine | CHEMBL354456
TypeSmall organic molecule
Emp. Form.C24H28N4O5S
Mol. Mass.484.568
SMILESNC(=N)c1ccc(CC(=O)CN2CCCC[C@H](NS(=O)(=O)c3ccc4OCCc4c3)C2=O)cc1