Reaction Details
TargetProthrombin
LigandBDBM50110392
Substrate/Competitorn/a
Meas. Tech.ChEBML_208524
Ki 13±n/a nM
Citation Ho, JZGibson, TSSemple, JE Novel, potent non-covalent thrombin inhibitors incorporating p(3)-lactam scaffolds. Bioorg Med Chem Lett12:743-8 (2002) Prothrombin
Name:Prothrombin
Type:Protein
Mol. Mass.:70029.57
Organism:Homo sapiens (Human)
Description:P00734
Residue:622
BDBM50110392
NameBDBM50110392
Synonyms:4-{3-[(S)-3-(3,4-Dimethoxy-benzenesulfonylamino)-2-oxo-azepan-1-yl]-2-oxo-propyl}-benzamidine | CHEMBL351616
TypeSmall organic molecule
Emp. Form.C24H30N4O6S
Mol. Mass.502.583
SMILESCOc1ccc(cc1OC)S(=O)(=O)N[C@H]1CCCCN(CC(=O)Cc2ccc(cc2)C(N)=N)C1=O