Reaction Details
TargetSodium-dependent serotonin transporter
LigandBDBM50063266
Substrate/Competitorn/a
Meas. Tech.ChEBML_201974
Ki 0.170000±n/a nM
Citation Se Lee, BChu, SLee, BSYoon Chi, DSong, YSJin, C Syntheses and binding affinities of 6-nitroquipazine analogues for serotonin transporter. Part 2: 4-substituted 6-nitroquipazines. Bioorg Med Chem Lett12:811-5 (2002) Sodium-dependent serotonin transporter
Name:Sodium-dependent serotonin transporter
Type:Multi-pass membrane protein
Mol. Mass.:70168.43
Organism:Rattus norvegicus (rat)
Description:P31652
Residue:630
BDBM50063266
NameBDBM50063266
Synonyms:6-Nitro-2-piperazin-1-yl-quinoline CHEMBL41140
TypeSmall organic molecule
Emp. Form.C13H14N4O2
Mol. Mass.258.2759
SMILES[O-][N+](=O)c1ccc2nc(ccc2c1)N1CCNCC1