Reaction Details
TargetProthrombin
LigandBDBM50111117
Substrate/Competitorn/a
Meas. Tech.ChEBML_208337
Ki 0.500000±n/a nM
Citation Lee, KJung, WHPark, CWPark, HDLee, SHKwon, OH Noncovalent tripeptidic thrombin inhibitors incorporating amidrazone, amine and amidine functions at P1. Bioorg Med Chem Lett12:1017-22 (2002) Prothrombin
Name:Prothrombin
Type:Protein
Mol. Mass.:70029.57
Organism:Homo sapiens (Human)
Description:P00734
Residue:622
BDBM50111117
NameBDBM50111117
Synonyms:(S)-1-((R)-2-Cyclohexyl-2-methanesulfonylamino-acetyl)-pyrrolidine-2-carboxylic acid 4-carbamimidoyl-benzylamide | CHEMBL451242
TypeSmall organic molecule
Emp. Form.C22H33N5O4S
Mol. Mass.463.594
SMILESCS(=O)(=O)N[C@H](C1CCCCC1)C(=O)N1CCC[C@H]1C(=O)NCc1ccc(cc1)C(N)=N