Reaction Details
TargetProthrombin
LigandBDBM50069294
Substrate/Competitorn/a
Meas. Tech.ChEBML_208337
Ki 0.380000±n/a nM
Citation Lee, KJung, WHPark, CWPark, HDLee, SHKwon, OH Noncovalent tripeptidic thrombin inhibitors incorporating amidrazone, amine and amidine functions at P1. Bioorg Med Chem Lett12:1017-22 (2002) Prothrombin
Name:Prothrombin
Type:Protein
Mol. Mass.:70029.57
Organism:Homo sapiens (Human)
Description:P00734
Residue:622
BDBM50069294
NameBDBM50069294
Synonyms:(S)-3-[4-(carbohydrazonamidol)-phenyl]-N-cyclopentyl-N-methyl-2-(naphthalene-2-sulfonylamino)-propionamide 1N-cyclopentyl-1N-methyl-3-(4-Carbohydrazonamidephenyl)-2-(2-naphthylsulfonamido)-(2S)-propanamide Benzamidrazone analogue N-methyl-N-cyclopentyl-3-(4-hydrazonoformamidephenyl)-2-[(2-naphthylsulfonyl)amino]propanamide
TypeSmall organic molecule
Emp. Form.C26H31N5O3S
Mol. Mass.493.621
SMILESCN(C1CCCC1)C(=O)[C@H](Cc1ccc(cc1)C(N)=NN)NS(=O)(=O)c1ccc2ccccc2c1