Reaction Details
TargetEndothelin-converting enzyme 1
LigandBDBM50112398
Substrate/Competitorn/a
Meas. Tech.ChEBML_64349
IC50 3800±n/a nM
Citation Yamazaki, KHasegawa, HUmekawa, KUeki, YOhashi, NKanaoka, M Design, synthesis and biological activity of novel non-peptidyl endothelin converting enzyme inhibitors, 1-phenyl-tetrazole-formazan analogues. Bioorg Med Chem Lett12:1275-8 (2002) Endothelin-converting enzyme 1
Name:Endothelin-converting enzyme 1
Type:Protein
Mol. Mass.:86126.89
Organism:Rattus norvegicus (Rat)
Description:P42893
Residue:762
BDBM50112398
NameBDBM50112398
Synonyms:5-{(2Z)-2-[[(E)-(4-ethylphenyl)diazenyl](phenyl)methylene]hydrazino}-1-phenyl-1H-tetrazole | CHEMBL23324
TypeSmall organic molecule
Emp. Form.C22H20N8
Mol. Mass.396.4478
SMILESCCc1ccc(NN=C(N=Nc2nnnn2-c2ccccc2)c2ccccc2)cc1