Reaction Details
TargetThymidine phosphorylase
LigandBDBM50121753
Substrate/Competitorn/a
Meas. Tech.ChEBML_208388
Ki 5±n/a nM
Citation Price, MLGuida, WCJackson, TENydick, JAGladstone, PLJuarez, JCDoñate, FTernansky, RJ Design of novel N-(2,4-dioxo-1,2,3,4-tetrahydro-thieno[3,2-d]pyrimidin-7-yl)-guanidines as thymidine phosphorylase inhibitors, and flexible docking to a homology model. Bioorg Med Chem Lett13:107-10 (2002) Thymidine phosphorylase
Name:Thymidine phosphorylase
Type:Enzyme
Mol. Mass.:49948.87
Organism:Homo sapiens (Human)
Description:The recombinant human thymidine phosphorylase (V79TP) was expressed in V79 Chinese hamster cells (Sigma, T-9319).
Residue:482
BDBM50121753
NameBDBM50121753
Synonyms:1-(5-Chloro-2,6-dioxo-1,2,3,6-tetrahydro-pyrimidin-4-ylmethyl)-pyrrolidin-2-ylidene-ammonium | 1-[(5-chloro-2,6-dioxo-1,2,3,6-tetrahydropyrimidin-4-yl)methyl]pyrrolidin-2-iminium
TypeSmall organic molecule
Emp. Form.C9H12ClN4O2
Mol. Mass.243.67
SMILESNC1=[N+](Cc2[nH]c(=O)[nH]c(=O)c2Cl)CCC1