Reaction Details
TargetThymidine phosphorylase
LigandBDBM50121754
Substrate/Competitorn/a
Meas. Tech.ChEBML_208388
Ki 76000±n/a nM
Citation Price, MLGuida, WCJackson, TENydick, JAGladstone, PLJuarez, JCDoñate, FTernansky, RJ Design of novel N-(2,4-dioxo-1,2,3,4-tetrahydro-thieno[3,2-d]pyrimidin-7-yl)-guanidines as thymidine phosphorylase inhibitors, and flexible docking to a homology model. Bioorg Med Chem Lett13:107-10 (2002) Thymidine phosphorylase
Name:Thymidine phosphorylase
Type:Enzyme
Mol. Mass.:49948.87
Organism:Homo sapiens (Human)
Description:The recombinant human thymidine phosphorylase (V79TP) was expressed in V79 Chinese hamster cells (Sigma, T-9319).
Residue:482
BDBM50121754
NameBDBM50121754
Synonyms:CHEMBL12488 | amino[(2,4-dioxo-1,2,3,4-tetrahydrothieno[3,2-d]pyrimidin-7-yl)amino]methaniminium acetate
TypeSmall organic molecule
Emp. Form.C7H8N5O2S
Mol. Mass.226.235
SMILESNC(N)=[NH+]c1csc2c1[nH]c(=O)[nH]c2=O