Reaction Details
TargetSerum paraoxonase/arylesterase 1
LigandBDBM24514
Substrate/Competitorn/a
Meas. Tech.ChEBML_152860
IC50 18500000±n/a nM
Citation Bargota, RSAkhtar, MBiggadike, KGani, DAllemann, RK Structure-activity relationship on human serum paraoxonase (PON1) using substrate analogues and inhibitors. Bioorg Med Chem Lett13:1623-6 (2003) Serum paraoxonase/arylesterase 1
Name:Serum paraoxonase/arylesterase 1
Type:Enzyme
Mol. Mass.:39719.73
Organism:Homo sapiens (Human)
Description:P27169
Residue:355
BDBM24514
NameBDBM24514
Synonyms:4-nitrophenoxyphosphonic acid CHEMBL24231 | p-nitrophenyl phosphate
TypeSmall organic molecule
Emp. Form.C6H6NO6P
Mol. Mass.219.0887
SMILESOP(O)(=O)Oc1ccc(cc1)[N+]([O-])=O