Reaction Details
TargetProgesterone receptor
LigandBDBM50129166
Substrate/Competitorn/a
Meas. Tech.ChEMBL_159552 (CHEMBL765840)
Ki 5.6±n/a nM
Citation Zhi, LRinggenberg, JDEdwards, JPTegley, CMWest, SJPio, BMotamedi, MJones, TKMarschke, KBMais, DESchrader, WT Development of progesterone receptor antagonists from 1,2-dihydrochromeno[3,4-f]quinoline agonist pharmacophore. Bioorg Med Chem Lett13:2075-8 (2003) Progesterone receptor
Name:Progesterone receptor
Type:Protein
Mol. Mass.:98979.52
Organism:Homo sapiens (Human)
Description:P06401
Residue:933
BDBM50129166
NameBDBM50129166
Synonyms:9-Chloro-7-fluoro-2,2,4-trimethyl-2,5-dihydro-1H-6-oxa-1-aza-chrysene CHEMBL65743
TypeSmall organic molecule
Emp. Form.C19H17ClFNO
Mol. Mass.329.796
SMILESCC1=CC(C)(C)Nc2ccc-3c(COc4c(F)cc(Cl)cc-34)c12