Reaction Details
TargetProgesterone receptor
LigandBDBM50129165
Substrate/Competitorn/a
Meas. Tech.ChEMBL_159553 (CHEMBL765841)
Ki 6.8±n/a nM
Citation Zhi, LRinggenberg, JDEdwards, JPTegley, CMWest, SJPio, BMotamedi, MJones, TKMarschke, KBMais, DESchrader, WT Development of progesterone receptor antagonists from 1,2-dihydrochromeno[3,4-f]quinoline agonist pharmacophore. Bioorg Med Chem Lett13:2075-8 (2003) Progesterone receptor
Name:Progesterone receptor
Type:Protein
Mol. Mass.:98979.52
Organism:Homo sapiens (Human)
Description:P06401
Residue:933
BDBM50129165
NameBDBM50129165
Synonyms:2,2,4-Trimethyl-9-nitro-2,5-dihydro-1H-6-oxa-1-aza-chrysene CHEMBL64294
TypeSmall organic molecule
Emp. Form.C19H18N2O3
Mol. Mass.322.3578
SMILESCC1=CC(C)(C)Nc2ccc-3c(COc4ccc(cc-34)[N+]([O-])=O)c12