Reaction Details
TargetcGMP-dependent 3',5'-cyclic phosphodiesterase
LigandBDBM14390
Substrate/Competitorn/a
Meas. Tech.ChEBML_156305
IC50 43000±n/a nM
Citation Ukita, TNakamura, YKubo, AYamamoto, YMoritani, YSaruta, KHigashijima, TKotera, JFujishige, KTakagi, MKikkawa, KOmori, K 1,7- and 2,7-naphthyridine derivatives as potent and highly specific PDE5 inhibitors. Bioorg Med Chem Lett13:2341-5 (2003) cGMP-dependent 3',5'-cyclic phosphodiesterase
Name:cGMP-dependent 3',5'-cyclic phosphodiesterase
Type:PROTEIN
Mol. Mass.:103200.18
Organism:Bos taurus
Description:ChEMBL_154420
Residue:921
BDBM14390
NameBDBM14390
Synonyms:5-[2-ethoxy-5-(4-methyl-1-piperazinylsulfonyl)phenyl]-1-methyl-3-n-propyl-1,6-dihydro-7H-pyrazolo[4,3-d]pyrimidin-7-one CHEMBL192 Sildenafil US11155558, Compound sildenafil Viagra
TypeSmall organic molecule
Emp. Form.C22H30N6O4S
Mol. Mass.474.576
SMILESCCCc1nn(C)c2c1nc([nH]c2=O)-c1cc(ccc1OCC)S(=O)(=O)N1CCN(C)CC1