Reaction Details
TargetAcyl carrier protein,/NADH dehydrogenase [ubiquinone] flavoprotein 1, mitochondrial
LigandBDBM50116000
Substrate/Competitorn/a
Meas. Tech.ChEMBL_141733 (CHEMBL749246)
IC50 0.900000±n/a nM
Citation Yabunaka, HAbe, MKenmochi, AHamada, TNishioka, TMiyoshi, H Synthesis and inhibitory activity of ubiquinone-acetogenin hybrid inhibitor with bovine mitochondrial complex I. Bioorg Med Chem Lett13:2385-8 (2003) Acyl carrier protein,/NADH dehydrogenase [ubiquinone] flavoprotein 1, mitochondrial
Name:Acyl carrier protein,/NADH dehydrogenase [ubiquinone] flavoprotein 1, mitochondrial
Synonyms:Mitochondrial complex I; NADH oxidoreductase
Type:n/a
Mol. Mass.:n/a
Description:ASSAY_ID of EBI is 141738
Components:This complex has 2 components.
Component 1
Name:NADH dehydrogenase [ubiquinone] flavoprotein 1, mitochondrial
Type:PROTEIN
Mol. Mass.:50659.85
Organism:Bos taurus
Description:EBI_100771
Residue:464
Component 2
Name:Acyl carrier protein, mitochondrial
Synonyms:ACP CI-SDAP NDUFAB1
Type:PROTEIN
Mol. Mass.:17397.64
Organism:Bos taurus
Description:ChEMBL_469770
Residue:156
BDBM50116000
NameBDBM50116000
Synonyms:(S)-3-{(12R,13R)-13-Hydroxy-13-[(4R,2'R,5'R)-5'-((R)-1-hydroxy-undecyl)-octahydro-[2,2']bifuranyl-5-yl]-tridecyl}-5-methyl-5H-furan-2-one (S)-3-{(R)-13-Hydroxy-13-[(2R,5R,2'R,5'R)-5'-((R)-1-hydroxy-undecyl)-octahydro-[2,2']bifuranyl-5-yl]-tridecyl}-5-methyl-5H-furan-2-one | CHEMBL62800
TypeSmall organic molecule
Emp. Form.C37H66O6
Mol. Mass.606.9163
SMILESCCCCCCCCCC[C@@H](O)[C@H]1CC[C@@H](O1)[C@H]1CC[C@@H](O1)[C@H](O)CCCCCCCCCCCCC1=C[C@H](C)OC1=O