Reaction Details
TargetPotassium voltage-gated channel subfamily H member 2
LigandBDBM81939
Substrate/Competitorn/a
Meas. Tech.ChEMBL_158540 (CHEMBL766814)
IC50 141±n/a nM
Citation Keserü, GM Prediction of hERG potassium channel affinity by traditional and hologram qSAR methods. Bioorg Med Chem Lett13:2773-5 (2003) Potassium voltage-gated channel subfamily H member 2
Name:Potassium voltage-gated channel subfamily H member 2
Type:Multi-pass membrane protein
Mol. Mass.:126672.65
Organism:Homo sapiens (Human)
Description:Q12809
Residue:1159
BDBM81939
NameBDBM81939
Synonyms:CAS_52-53-9 VERAPAMIL
TypeSmall organic molecule
Emp. Form.C27H38N2O4
Mol. Mass.454.6016
SMILESCOc1ccc(CCN(C)CCCC(C#N)(C(C)C)c2ccc(OC)c(OC)c2)cc1OC