Reaction Details
TargetPotassium voltage-gated channel subfamily H member 2
LigandBDBM25759
Substrate/Competitorn/a
Meas. Tech.ChEMBL_158540 (CHEMBL766814)
IC50 10471±n/a nM
Citation Keserü, GM Prediction of hERG potassium channel affinity by traditional and hologram qSAR methods. Bioorg Med Chem Lett13:2773-5 (2003) Potassium voltage-gated channel subfamily H member 2
Name:Potassium voltage-gated channel subfamily H member 2
Type:Multi-pass membrane protein
Mol. Mass.:126672.65
Organism:Homo sapiens (Human)
Description:Q12809
Residue:1159
BDBM25759
NameBDBM25759
Synonyms:CHEMBL723 Coreg Eucardic | [3-(9H-carbazol-4-yloxy)-2-hydroxypropyl][2-(2-methoxyphenoxy)ethyl]amine
TypeSmall organic molecule
Emp. Form.C24H26N2O4
Mol. Mass.406.4742
SMILESCOc1ccccc1OCCNCC(O)COc1cccc2[nH]c3ccccc3c12