Reaction Details
TargetXanthine dehydrogenase/oxidase
LigandBDBM50131452
Substrate/Competitorn/a
Meas. Tech.ChEBML_216934
IC50 94700±n/a nM
Citation Jagadeeshwar Rao, RTiwari, AKKumar, USReddy, SVAli, AZRao, JM Novel 3-O-acyl mesquitol analogues as free-radical scavengers and enzyme inhibitors: synthesis, biological evaluation and structure-activity relationship. Bioorg Med Chem Lett13:2777-80 (2003) Xanthine dehydrogenase/oxidase
Name:Xanthine dehydrogenase/oxidase
Type:Enzyme
Mol. Mass.:146441.21
Organism:Homo sapiens (Human)
Description:P47989
Residue:1333
BDBM50131452
NameBDBM50131452
Synonyms:CHEMBL92193 | Hexadecanoic acid (2S,3R)-2-(3,4-dihydroxy-phenyl)-7,8-dihydroxy-chroman-3-yl ester
TypeSmall organic molecule
Emp. Form.C31H44O7
Mol. Mass.528.6769
(=O)O[C@@H]1Cc2ccc(O)c(O)c2O[C@H]1c1ccc(O)c(O)c1