Reaction Details
TargetProthrombin
LigandBDBM50131458
Substrate/Competitorn/a
Meas. Tech.ChEBML_208517
Ki 0.170000±n/a nM
Citation Nantermet, PGBarrow, JCNewton, CLPellicore, JMYoung, MLewis, SDLucas, BJKrueger, JAMcMasters, DRYan, YKuo, LCVacca, JPSelnick, HG Design and synthesis of potent and selective macrocyclic thrombin inhibitors. Bioorg Med Chem Lett13:2781-4 (2003) Prothrombin
Name:Prothrombin
Type:Protein
Mol. Mass.:70029.57
Organism:Homo sapiens (Human)
Description:P00734
Residue:622
BDBM50131458
NameBDBM50131458
Synonyms:(14E,21S)-21-benzyl-8,26-dichloro-12,17-dioxa-1,4,19,22,24-pentaazatricyclo[21.3.1.0^{6,11}]heptacosa-6(11),7,9,14,23,25-hexaene-3,18,27-trione | CHEMBL94864
TypeSmall organic molecule
Emp. Form.C27H27Cl2N5O5
Mol. Mass.572.44
SMILESClc1ccc2OC\C=C\COC(=O)NC[C@H](Cc3ccccc3)Nc3ncc(Cl)n(CC(=O)NCc2c1)c3=O