Reaction Details
TargetTissue-type plasminogen activator
LigandBDBM50131464
Substrate/Competitorn/a
Meas. Tech.ChEBML_207888
Ki 150±n/a nM
Citation Nantermet, PGBarrow, JCNewton, CLPellicore, JMYoung, MLewis, SDLucas, BJKrueger, JAMcMasters, DRYan, YKuo, LCVacca, JPSelnick, HG Design and synthesis of potent and selective macrocyclic thrombin inhibitors. Bioorg Med Chem Lett13:2781-4 (2003) Tissue-type plasminogen activator
Name:Tissue-type plasminogen activator
Type:Enzyme
Mol. Mass.:62931.08
Organism:Homo sapiens (Human)
Description:n/a
Residue:562
BDBM50131464
NameBDBM50131464
Synonyms:(S)-20-Benzyl-8,25-dichloro-12,15-dioxa-1,4,18,21,23-pentaaza-tricyclo[20.3.1.0*6,11*]hexacosa-6(11),7,9,22,24-pentaene-3,26-dione | CHEMBL96354
TypeSmall organic molecule
Emp. Form.C26H29Cl2N5O4
Mol. Mass.546.446
SMILESClc1ccc2OCCOCCNC[C@H](Cc3ccccc3)Nc3ncc(Cl)n(CC(=O)NCc2c1)c3=O