Reaction Details
TargetTissue-type plasminogen activator
LigandBDBM50131466
Substrate/Competitorn/a
Meas. Tech.ChEBML_207888
Ki 20±n/a nM
Citation Nantermet, PGBarrow, JCNewton, CLPellicore, JMYoung, MLewis, SDLucas, BJKrueger, JAMcMasters, DRYan, YKuo, LCVacca, JPSelnick, HG Design and synthesis of potent and selective macrocyclic thrombin inhibitors. Bioorg Med Chem Lett13:2781-4 (2003) Tissue-type plasminogen activator
Name:Tissue-type plasminogen activator
Type:Enzyme
Mol. Mass.:62931.08
Organism:Homo sapiens (Human)
Description:n/a
Residue:562
BDBM50131466
NameBDBM50131466
Synonyms:(S)-19-Benzyl-8,24-dichloro-12-oxa-1,4,17,20,22-pentaaza-tricyclo[19.3.1.0*6,11*]pentacosa-6(11),7,9,21,23-pentaene-3,25-dione | CHEMBL316901
TypeSmall organic molecule
Emp. Form.C26H29Cl2N5O3
Mol. Mass.530.446
SMILESClc1ccc2OCCCCNC[C@H](Cc3ccccc3)Nc3ncc(Cl)n(CC(=O)NCc2c1)c3=O