Reaction Details
TargetSerine protease 1
LigandBDBM50131480
Substrate/Competitorn/a
Meas. Tech.ChEBML_212867
Ki 40±n/a nM
Citation Nantermet, PGBarrow, JCNewton, CLPellicore, JMYoung, MLewis, SDLucas, BJKrueger, JAMcMasters, DRYan, YKuo, LCVacca, JPSelnick, HG Design and synthesis of potent and selective macrocyclic thrombin inhibitors. Bioorg Med Chem Lett13:2781-4 (2003) Serine protease 1
Name:Serine protease 1
Type:Enzyme
Mol. Mass.:26557.80
Organism:Homo sapiens (Human)
Description:P07477
Residue:247
BDBM50131480
NameBDBM50131480
Synonyms:(S)-20-Benzyl-8,25-dichloro-18-methyl-12-oxa-1,4,18,21,23-pentaaza-tricyclo[20.3.1.0*6,11*]hexacosa-6(11),7,9,22,24-pentaene-3,26-dione | CHEMBL92615
TypeSmall organic molecule
Emp. Form.C28H33Cl2N5O3
Mol. Mass.558.499
SMILESCN1CCCCCOc2ccc(Cl)cc2CNC(=O)Cn2c(Cl)cnc(N[C@@H](Cc3ccccc3)C1)c2=O