Reaction Details
TargetCarbonic anhydrase 2
LigandBDBM50135610
Substrate/Competitorn/a
Meas. Tech.ChEBML_45085
Ki 1.7±n/a nM
Citation Casini, AScozzafava, AMincione, FMenabuoni, LStarnotti, MSupuran, CT Carbonic anhydrase inhibitors: topically acting antiglaucoma sulfonamides incorporating esters and amides of 3- and 4-carboxybenzolamide. Bioorg Med Chem Lett13:2867-73 (2003) Carbonic anhydrase 2
Name:Carbonic anhydrase 2
Type:Enzyme
Mol. Mass.:29250.71
Organism:Homo sapiens (Human)
Description:P00918
Residue:260
BDBM50135610
NameBDBM50135610
Synonyms:CHEMBL100329 | N-(2-Diethylamino-ethyl)-3-(5-sulfamoyl-[1,3,4]thiadiazol-2-ylsulfamoyl)-benzamide
TypeSmall organic molecule
Emp. Form.C15H22N6O5S3
Mol. Mass.462.567
SMILESCCN(CC)CCNC(=O)c1cccc(c1)S(=O)(=O)Nc1nnc(s1)S(N)(=O)=O