Reaction Details
TargetThymidylate kinase
LigandBDBM50132298
Substrate/Competitorn/a
Meas. Tech.ChEBML_208218
Ki 97000±n/a nM
Citation Vanheusden, VVan Rompaey, PMunier-Lehmann, HPochet, SHerdewijn, PVan Calenbergh, S Thymidine and thymidine-5'-O-monophosphate analogues as inhibitors of Mycobacterium tuberculosis thymidylate kinase. Bioorg Med Chem Lett13:3045-8 (2003) Thymidylate kinase
Name:Thymidylate kinase
Type:PROTEIN
Mol. Mass.:22636.29
Organism:Mycobacterium tuberculosis
Description:ChEMBL_208218
Residue:214
BDBM50132298
NameBDBM50132298
Synonyms:1-((2R,4S,5R)-4-hydroxy-5-(hydroxymethyl)-tetrahydrofuran-2-yl)-5-(trifluoromethyl)pyrimidine-2,4(1H,3H)-dione 5-trifluoromethyl-2'-deoxyuridine TRIFLURIDINE Viroptic cid_6708818
TypeSmall organic molecule
Emp. Form.C10H11F3N2O5
Mol. Mass.296.1999
SMILESOC[C@H]1O[C@H](C[C@@H]1O)n1cc(c(=O)[nH]c1=O)C(F)(F)F