Reaction Details
TargetLow affinity immunoglobulin epsilon Fc receptor
LigandBDBM50132437
Substrate/Competitorn/a
Meas. Tech.ChEBML_163803
EC50>10000±n/a nM
Citation Lai, JYCox, PJPatel, RSadiq, SAldous, DJThurairatnam, SSmith, KWheeler, DJagpal, SParveen, SFenton, GHarrison, TKMcCarthy, CBamborough, P Potent small molecule inhibitors of spleen tyrosine kinase (Syk). Bioorg Med Chem Lett13:3111-4 (2003) Low affinity immunoglobulin epsilon Fc receptor
Name:Low affinity immunoglobulin epsilon Fc receptor
Type:PROTEIN
Mol. Mass.:36461.84
Organism:Homo sapiens (Human)
Description:ChEMBL_88888
Residue:321
BDBM50132437
NameBDBM50132437
Synonyms:3-((1-(3-hydroxypropyl)-5-methoxy-1H-indol-3-yl)methylene)-2-oxoindoline-5-sulfonamide CHEMBL107061
TypeSmall organic molecule
Emp. Form.C21H21N3O5S
Mol. Mass.427.474
SMILESCOc1ccc2n(CCCO)cc(\C=C3/C(=O)Nc4ccc(cc34)S(N)(=O)=O)c2c1