Reaction Details
TargetTyrosine-protein kinase SYK
LigandBDBM50132440
Substrate/Competitorn/a
Meas. Tech.ChEBML_206946
IC50 850±n/a nM
Citation Lai, JYCox, PJPatel, RSadiq, SAldous, DJThurairatnam, SSmith, KWheeler, DJagpal, SParveen, SFenton, GHarrison, TKMcCarthy, CBamborough, P Potent small molecule inhibitors of spleen tyrosine kinase (Syk). Bioorg Med Chem Lett13:3111-4 (2003) Tyrosine-protein kinase SYK
Name:Tyrosine-protein kinase SYK
Type:Enzyme
Mol. Mass.:72079.99
Organism:Homo sapiens (Human)
Description:P43405
Residue:635
BDBM50132440
NameBDBM50132440
Synonyms:2-(5-methoxy-3-((2-oxo-5-sulfamoylindolin-3-ylidene)methyl)-1H-indol-1-yl)acetic acid CHEMBL420100 | {5-Methoxy-3-[2-oxo-5-sulfamoyl-1,2-dihydro-indol-(3Z)-ylidenemethyl]-indol-1-yl}-acetic acid; piperidine salt
TypeSmall organic molecule
Emp. Form.C20H17N3O6S
Mol. Mass.427.43
SMILESCOc1ccc2n(CC(O)=O)cc(\C=C3/C(=O)Nc4ccc(cc34)S(N)(=O)=O)c2c1